[GUMP@vmgump-vm3]: Project tomcat-tc8.0.x-validate (in module tomcat-8.0.x) failed

Previous Topic Next Topic
 
classic Classic list List threaded Threaded
1 message Options
Reply | Threaded
Open this post in threaded view
|

[GUMP@vmgump-vm3]: Project tomcat-tc8.0.x-validate (in module tomcat-8.0.x) failed

Bill Barker-5
To whom it may engage...
       
This is an automated request, but not an unsolicited one. For
more information please visit http://gump.apache.org/nagged.html,
and/or contact the folk at [hidden email].

Project tomcat-tc8.0.x-validate has an issue affecting its community integration.
This issue affects 1 projects.
The current state of this project is 'Failed', with reason 'Build Failed'.
For reference only, the following projects are affected by this:
    - tomcat-tc8.0.x-validate :  Tomcat 8.x, a web server implementing the Java Servlet 3.1,
...


Full details are available at:
    http://vmgump-vm3.apache.org/tomcat-8.0.x/tomcat-tc8.0.x-validate/index.html

That said, some information snippets are provided here.

The following annotations (debug/informational/warning/error messages) were provided:
 -DEBUG- Dependency on checkstyle exists, no need to add for property checkstyle.jar.
 -INFO- Failed with reason build failed



The following work was performed:
http://vmgump-vm3.apache.org/tomcat-8.0.x/tomcat-tc8.0.x-validate/gump_work/build_tomcat-8.0.x_tomcat-tc8.0.x-validate.html
Work Name: build_tomcat-8.0.x_tomcat-tc8.0.x-validate (Type: Build)
Work ended in a state of : Failed
Elapsed: 27 secs
Command Line: /usr/lib/jvm/java-8-oracle/bin/java -Djava.awt.headless=true -Dbuild.sysclasspath=only org.apache.tools.ant.Main -Dgump.merge=/srv/gump/public/gump/work/merge.xml -Dbase.path=/srv/gump/public/workspace/tomcat-8.0.x/tomcat-build-libs -Dcheckstyle.jar=/srv/gump/public/workspace/checkstyle/target/checkstyle-8.4-SNAPSHOT.jar -Dexecute.validate=true validate
[Working Directory: /srv/gump/public/workspace/tomcat-8.0.x]
CLASSPATH: /usr/lib/jvm/java-8-oracle/lib/tools.jar:/srv/gump/public/workspace/ant/dist/lib/ant.jar:/srv/gump/public/workspace/ant/dist/lib/ant-launcher.jar:/srv/gump/public/workspace/ant/dist/lib/ant-jmf.jar:/srv/gump/public/workspace/ant/dist/lib/ant-junit.jar:/srv/gump/public/workspace/ant/dist/lib/ant-junit4.jar:/srv/gump/public/workspace/ant/dist/lib/ant-swing.jar:/srv/gump/public/workspace/ant/dist/lib/ant-apache-resolver.jar:/srv/gump/public/workspace/ant/dist/lib/ant-apache-xalan2.jar:/srv/gump/public/workspace/xml-commons/java/build/resolver.jar:/srv/gump/public/workspace/checkstyle/target/checkstyle-8.4-SNAPSHOT.jar:/srv/gump/packages/antlr/antlr-3.1.3.jar:/srv/gump/public/workspace/apache-commons/beanutils/dist/commons-beanutils-20171012.jar:/srv/gump/packages/commons-collections3/commons-collections-3.2.1.jar:/srv/gump/public/workspace/commons-cli/target/commons-cli-1.5-SNAPSHOT.jar:/srv/gump/public/workspace/commons-lang-trunk/target/commons-lang3-3.7-SNAPSHOT.jar:/srv/g
 ump/public/workspace/apache-commons/logging/target/commons-logging-20171012.jar:/srv/gump/public/workspace/apache-commons/logging/target/commons-logging-api-20171012.jar:/srv/gump/public/workspace/google-guava/guava/target/guava-HEAD-jre-SNAPSHOT.jar
---------------------------------------------
[checkstyle] [ERROR] /srv/gump/public/workspace/tomcat-8.0.x/test/org/apache/el/TestValueExpressionImpl.java:34: Extra separation in import group before 'org.junit.Test' [ImportOrder]
[checkstyle] [ERROR] /srv/gump/public/workspace/tomcat-8.0.x/test/org/apache/el/lang/TestELArithmetic.java:26: Extra separation in import group before 'org.junit.Assert' [ImportOrder]
[checkstyle] [ERROR] /srv/gump/public/workspace/tomcat-8.0.x/test/org/apache/el/lang/TestELSupport.java:30: Extra separation in import group before 'org.junit.Assert' [ImportOrder]
[checkstyle] [ERROR] /srv/gump/public/workspace/tomcat-8.0.x/test/org/apache/el/parser/TestELParser.java:28: Extra separation in import group before 'org.junit.Test' [ImportOrder]
[checkstyle] [ERROR] /srv/gump/public/workspace/tomcat-8.0.x/test/org/apache/jasper/compiler/TestAttributeParser.java:24: Extra separation in import group before 'org.junit.Test' [ImportOrder]
[checkstyle] [ERROR] /srv/gump/public/workspace/tomcat-8.0.x/test/org/apache/jasper/compiler/TestCompiler.java:29: Extra separation in import group before 'org.junit.Test' [ImportOrder]
[checkstyle] [ERROR] /srv/gump/public/workspace/tomcat-8.0.x/test/org/apache/jasper/compiler/TestGenerator.java:36: Extra separation in import group before 'org.junit.Assert' [ImportOrder]
[checkstyle] [ERROR] /srv/gump/public/workspace/tomcat-8.0.x/test/org/apache/jasper/compiler/TestJspConfig.java:24: Extra separation in import group before 'org.junit.Test' [ImportOrder]
[checkstyle] [ERROR] /srv/gump/public/workspace/tomcat-8.0.x/test/org/apache/jasper/compiler/TestParser.java:25: Extra separation in import group before 'org.junit.Assert' [ImportOrder]
[checkstyle] [ERROR] /srv/gump/public/workspace/tomcat-8.0.x/test/org/apache/jasper/compiler/TestParserNoStrictWhitespace.java:26: Extra separation in import group before 'org.junit.Test' [ImportOrder]
[checkstyle] [ERROR] /srv/gump/public/workspace/tomcat-8.0.x/test/org/apache/jasper/compiler/TestScriptingVariabler.java:29: Extra separation in import group before 'org.junit.Test' [ImportOrder]
[checkstyle] [ERROR] /srv/gump/public/workspace/tomcat-8.0.x/test/org/apache/jasper/compiler/TestValidator.java:30: Extra separation in import group before 'org.junit.Test' [ImportOrder]
[checkstyle] [ERROR] /srv/gump/public/workspace/tomcat-8.0.x/test/org/apache/jasper/util/TestFastRemovalDequeue.java:22: Extra separation in import group before 'org.junit.Test' [ImportOrder]
[checkstyle] [ERROR] /srv/gump/public/workspace/tomcat-8.0.x/test/org/apache/juli/TestFileHandler.java:31: Extra separation in import group before 'org.junit.After' [ImportOrder]
[checkstyle] [ERROR] /srv/gump/public/workspace/tomcat-8.0.x/test/org/apache/juli/TestFileHandlerNonRotatable.java:24: Extra separation in import group before 'org.junit.After' [ImportOrder]
[checkstyle] [ERROR] /srv/gump/public/workspace/tomcat-8.0.x/test/org/apache/naming/resources/TestNamingContext.java:37: Extra separation in import group before 'org.junit.Assert' [ImportOrder]
[checkstyle] [ERROR] /srv/gump/public/workspace/tomcat-8.0.x/test/org/apache/naming/resources/TestWarDirContext.java:23: Extra separation in import group before 'org.junit.Test' [ImportOrder]
[checkstyle] [ERROR] /srv/gump/public/workspace/tomcat-8.0.x/test/org/apache/tomcat/util/buf/TestByteChunk.java:26: Extra separation in import group before 'org.junit.Test' [ImportOrder]
[checkstyle] [ERROR] /srv/gump/public/workspace/tomcat-8.0.x/test/org/apache/tomcat/util/buf/TestCharChunk.java:23: Extra separation in import group before 'org.junit.Test' [ImportOrder]
[checkstyle] [ERROR] /srv/gump/public/workspace/tomcat-8.0.x/test/org/apache/tomcat/util/buf/TestUDecoder.java:22: Extra separation in import group before 'org.junit.Test' [ImportOrder]
[checkstyle] [ERROR] /srv/gump/public/workspace/tomcat-8.0.x/test/org/apache/tomcat/util/buf/TestUEncoder.java:25: Extra separation in import group before 'org.junit.Test' [ImportOrder]
[checkstyle] [ERROR] /srv/gump/public/workspace/tomcat-8.0.x/test/org/apache/tomcat/util/descriptor/web/TestSecurityConstraint.java:33: Extra separation in import group before 'org.junit.Assert' [ImportOrder]
[checkstyle] [ERROR] /srv/gump/public/workspace/tomcat-8.0.x/test/org/apache/tomcat/util/descriptor/web/TestWebRuleSet.java:27: Extra separation in import group before 'org.junit.Test' [ImportOrder]
[checkstyle] [ERROR] /srv/gump/public/workspace/tomcat-8.0.x/test/org/apache/tomcat/util/descriptor/web/TestWebXmlOrdering.java:31: Extra separation in import group before 'org.junit.Before' [ImportOrder]
[checkstyle] [ERROR] /srv/gump/public/workspace/tomcat-8.0.x/test/org/apache/tomcat/util/http/TestBug49158.java:33: Extra separation in import group before 'org.junit.Test' [ImportOrder]
[checkstyle] [ERROR] /srv/gump/public/workspace/tomcat-8.0.x/test/org/apache/tomcat/util/http/TestCookiesDefaultSysProps.java:25: Extra separation in import group before 'org.junit.Test' [ImportOrder]
[checkstyle] [ERROR] /srv/gump/public/workspace/tomcat-8.0.x/test/org/apache/tomcat/util/http/TestCookiesNoFwdStrictSysProps.java:21: Extra separation in import group before 'org.junit.Test' [ImportOrder]
[checkstyle] [ERROR] /srv/gump/public/workspace/tomcat-8.0.x/test/org/apache/tomcat/util/http/TestCookiesNoStrictNamingSysProps.java:21: Extra separation in import group before 'org.junit.Test' [ImportOrder]
[checkstyle] [ERROR] /srv/gump/public/workspace/tomcat-8.0.x/test/org/apache/tomcat/util/http/TestCookiesStrictSysProps.java:25: Extra separation in import group before 'org.junit.Test' [ImportOrder]
[checkstyle] [ERROR] /srv/gump/public/workspace/tomcat-8.0.x/test/org/apache/tomcat/util/http/TestMimeHeadersIntegration.java:32: Extra separation in import group before 'org.junit.Test' [ImportOrder]
[checkstyle] [ERROR] /srv/gump/public/workspace/tomcat-8.0.x/test/org/apache/tomcat/util/http/TestParameters.java:30: Extra separation in import group before 'org.junit.Test' [ImportOrder]
[checkstyle] [ERROR] /srv/gump/public/workspace/tomcat-8.0.x/test/org/apache/tomcat/util/http/TestRequestUtil.java:21: Extra separation in import group before 'org.junit.Test' [ImportOrder]
[checkstyle] [ERROR] /srv/gump/public/workspace/tomcat-8.0.x/test/org/apache/tomcat/util/http/parser/TestMediaType.java:26: Extra separation in import group before 'org.junit.Assert' [ImportOrder]
[checkstyle] [ERROR] /srv/gump/public/workspace/tomcat-8.0.x/test/org/apache/tomcat/util/net/TestClientCert.java:23: Extra separation in import group before 'org.junit.Assume' [ImportOrder]
[checkstyle] [ERROR] /srv/gump/public/workspace/tomcat-8.0.x/test/org/apache/tomcat/util/net/TestCustomSsl.java:28: Extra separation in import group before 'org.junit.Assume' [ImportOrder]
[checkstyle] [ERROR] /srv/gump/public/workspace/tomcat-8.0.x/test/org/apache/tomcat/util/net/TestSsl.java:34: Extra separation in import group before 'org.junit.Assert' [ImportOrder]
[checkstyle] [ERROR] /srv/gump/public/workspace/tomcat-8.0.x/test/org/apache/tomcat/util/net/TestXxxEndpoint.java:28: Extra separation in import group before 'org.junit.Test' [ImportOrder]
[checkstyle] [ERROR] /srv/gump/public/workspace/tomcat-8.0.x/test/org/apache/tomcat/util/res/TestStringManager.java:22: Extra separation in import group before 'org.junit.Test' [ImportOrder]
[checkstyle] [ERROR] /srv/gump/public/workspace/tomcat-8.0.x/test/org/apache/tomcat/util/scan/TestJarScanner.java:27: Extra separation in import group before 'org.junit.Test' [ImportOrder]
[checkstyle] [ERROR] /srv/gump/public/workspace/tomcat-8.0.x/modules/jdbc-pool/src/test/java/org/apache/tomcat/jdbc/bugs/Bug54225.java:25: Extra separation in import group before 'org.junit.Test' [ImportOrder]
[checkstyle] [ERROR] /srv/gump/public/workspace/tomcat-8.0.x/modules/jdbc-pool/src/test/java/org/apache/tomcat/jdbc/bugs/Bug54227.java:27: Extra separation in import group before 'org.junit.Test' [ImportOrder]
[checkstyle] [ERROR] /srv/gump/public/workspace/tomcat-8.0.x/modules/jdbc-pool/src/test/java/org/apache/tomcat/jdbc/bugs/Bug54978.java:23: Extra separation in import group before 'org.junit.Test' [ImportOrder]
[checkstyle] [ERROR] /srv/gump/public/workspace/tomcat-8.0.x/modules/jdbc-pool/src/test/java/org/apache/tomcat/jdbc/pool/ShouldForceReconnectTest.java:22: Extra separation in import group before 'org.junit.After' [ImportOrder]
[checkstyle] [ERROR] /srv/gump/public/workspace/tomcat-8.0.x/modules/jdbc-pool/src/test/java/org/apache/tomcat/jdbc/test/TestJdbcInterceptorConfigParsing.java:25: Extra separation in import group before 'org.junit.Test' [ImportOrder]
[checkstyle] [ERROR] /srv/gump/public/workspace/tomcat-8.0.x/modules/jdbc-pool/src/test/java/org/apache/tomcat/jdbc/test/TestValidationQueryTimeout.java:31: Extra separation in import group before 'org.junit.After' [ImportOrder]

BUILD FAILED
/srv/gump/public/workspace/tomcat-8.0.x/build.xml:557: Got 118 errors and 0 warnings.

Total time: 27 seconds
---------------------------------------------

To subscribe to this information via syndicated feeds:
- RSS: http://vmgump-vm3.apache.org/tomcat-8.0.x/tomcat-tc8.0.x-validate/rss.xml
- Atom: http://vmgump-vm3.apache.org/tomcat-8.0.x/tomcat-tc8.0.x-validate/atom.xml

============================== Gump Tracking Only ===
Produced by Apache Gump(TM) version 2.3.
Gump Run 20171012000009, vmgump-vm3.apache.org:vmgump:20171012000009
Gump E-mail Identifier (unique within run) #5.

--
Apache Gump
http://gump.apache.org/ [Instance: vmgump-vm3]

---------------------------------------------------------------------
To unsubscribe, e-mail: [hidden email]
For additional commands, e-mail: [hidden email]