[GUMP@vmgump-vm3]: Project tomcat-trunk-test-nio (in module tomcat-trunk) failed

Previous Topic Next Topic
 
classic Classic list List threaded Threaded
5 messages Options
Reply | Threaded
Open this post in threaded view
|

[GUMP@vmgump-vm3]: Project tomcat-trunk-test-nio (in module tomcat-trunk) failed

Bill Barker-5
To whom it may engage...
       
This is an automated request, but not an unsolicited one. For
more information please visit http://gump.apache.org/nagged.html,
and/or contact the folk at [hidden email].

Project tomcat-trunk-test-nio has an issue affecting its community integration.
This issue affects 1 projects,
 and has been outstanding for 11 runs.
The current state of this project is 'Failed', with reason 'Build Failed'.
For reference only, the following projects are affected by this:
    - tomcat-trunk-test-nio :  Tomcat 9.x, a web server implementing the Java Servlet 4.0,
...


Full details are available at:
    http://vmgump-vm3.apache.org/tomcat-trunk/tomcat-trunk-test-nio/index.html

That said, some information snippets are provided here.

The following annotations (debug/informational/warning/error messages) were provided:
 -INFO- Failed with reason build failed
 -INFO- Project Reports in: /srv/gump/public/workspace/tomcat-trunk/output/logs-NIO
 -INFO- Project Reports in: /srv/gump/public/workspace/tomcat-trunk/output/test-tmp-NIO/logs
 -WARNING- No directory [/srv/gump/public/workspace/tomcat-trunk/output/test-tmp-NIO/logs]



The following work was performed:
http://vmgump-vm3.apache.org/tomcat-trunk/tomcat-trunk-test-nio/gump_work/build_tomcat-trunk_tomcat-trunk-test-nio.html
Work Name: build_tomcat-trunk_tomcat-trunk-test-nio (Type: Build)
Work ended in a state of : Failed
Elapsed: 24 mins 24 secs
Command Line: /usr/lib/jvm/java-8-oracle/bin/java -Djava.awt.headless=true -Dbuild.sysclasspath=only org.apache.tools.ant.Main -Dgump.merge=/srv/gump/public/gump/work/merge.xml -Djunit.jar=/srv/gump/public/workspace/junit/target/junit-4.13-SNAPSHOT.jar -Djava.net.preferIPv4Stack=/srv/gump/public/workspace/tomcat-trunk/true -Dobjenesis.jar=/srv/gump/public/workspace/objenesis/main/target/objenesis-2.7-SNAPSHOT.jar -Dtest.reports=output/logs-NIO -Dexecute.test.nio2=false -Dexamples.sources.skip=true -Dbase.path=/srv/gump/public/workspace/tomcat-trunk/tomcat-build-libs -Djdt.jar=/srv/gump/packages/eclipse/plugins/R-4.5-201506032000/ecj-4.5.jar -Dtest.relaxTiming=true -Dcommons-daemon.jar=/srv/gump/public/workspace/apache-commons/daemon/target/commons-daemon-1.1.1-SNAPSHOT.jar -Dtest.temp=output/test-tmp-NIO -Dtest.accesslog=true -Dexecute.test.nio=true -Dtest.openssl.path=/srv/gump/public/workspace/openssl-master/dest-20180318/bin/openssl -Dexecute.test.apr=false -Dtest.excludePerforman
 ce=true -Deasymock.jar=/srv/gump/public/workspace/easymock/core/target/easymock-3.6-SNAPSHOT.jar -Dhamcrest.jar=/srv/gump/packages/hamcrest/hamcrest-core-1.3.jar -Dcglib.jar=/srv/gump/packages/cglib/cglib-nodep-2.2.jar test
[Working Directory: /srv/gump/public/workspace/tomcat-trunk]
CLASSPATH: /usr/lib/jvm/java-8-oracle/lib/tools.jar:/srv/gump/public/workspace/tomcat-trunk/output/build/webapps/examples/WEB-INF/classes:/srv/gump/public/workspace/tomcat-trunk/output/testclasses:/srv/gump/public/workspace/ant/dist/lib/ant.jar:/srv/gump/public/workspace/ant/dist/lib/ant-launcher.jar:/srv/gump/public/workspace/ant/dist/lib/ant-jmf.jar:/srv/gump/public/workspace/ant/dist/lib/ant-junit.jar:/srv/gump/public/workspace/ant/dist/lib/ant-junit4.jar:/srv/gump/public/workspace/ant/dist/lib/ant-swing.jar:/srv/gump/public/workspace/ant/dist/lib/ant-apache-resolver.jar:/srv/gump/public/workspace/ant/dist/lib/ant-apache-xalan2.jar:/srv/gump/public/workspace/xml-commons/java/build/resolver.jar:/srv/gump/public/workspace/tomcat-trunk/output/build/bin/bootstrap.jar:/srv/gump/public/workspace/tomcat-trunk/output/build/bin/tomcat-juli.jar:/srv/gump/public/workspace/tomcat-trunk/output/build/lib/annotations-api.jar:/srv/gump/public/workspace/tomcat-trunk/output/build/lib/servlet-api.ja
 r:/srv/gump/public/workspace/tomcat-trunk/output/build/lib/jsp-api.jar:/srv/gump/public/workspace/tomcat-trunk/output/build/lib/el-api.jar:/srv/gump/public/workspace/tomcat-trunk/output/build/lib/websocket-api.jar:/srv/gump/public/workspace/tomcat-trunk/output/build/lib/jaspic-api.jar:/srv/gump/public/workspace/tomcat-trunk/output/build/lib/catalina.jar:/srv/gump/public/workspace/tomcat-trunk/output/build/lib/catalina-ant.jar:/srv/gump/public/workspace/tomcat-trunk/output/build/lib/catalina-storeconfig.jar:/srv/gump/public/workspace/tomcat-trunk/output/build/lib/tomcat-coyote.jar:/srv/gump/public/workspace/tomcat-trunk/output/build/lib/jasper.jar:/srv/gump/public/workspace/tomcat-trunk/output/build/lib/jasper-el.jar:/srv/gump/public/workspace/tomcat-trunk/output/build/lib/catalina-tribes.jar:/srv/gump/public/workspace/tomcat-trunk/output/build/lib/catalina-ha.jar:/srv/gump/public/workspace/tomcat-trunk/output/build/lib/tomcat-api.jar:/srv/gump/public/workspace/tomcat-trunk/output/bu
 ild/lib/tomcat-jni.jar:/srv/gump/public/workspace/tomcat-trunk/output/build/lib/tomcat-util.jar:/srv/gump/public/workspace/tomcat-trunk/output/build/lib/tomcat-util-scan.jar:/srv/gump/public/workspace/tomcat-trunk/output/build/lib/tomcat-websocket.jar:/srv/gump/public/workspace/tomcat-trunk/output/build/lib/tomcat-i18n-es.jar:/srv/gump/public/workspace/tomcat-trunk/output/build/lib/tomcat-i18n-fr.jar:/srv/gump/public/workspace/tomcat-trunk/output/build/lib/tomcat-i18n-ja.jar:/srv/gump/packages/eclipse/plugins/R-4.5-201506032000/ecj-4.5.jar:/srv/gump/public/workspace/apache-commons/daemon/target/commons-daemon-1.1.1-SNAPSHOT.jar:/srv/gump/public/workspace/junit/target/junit-4.13-SNAPSHOT.jar:/srv/gump/packages/hamcrest/hamcrest-core-1.3.jar:/srv/gump/packages/cglib/cglib-nodep-2.2.jar:/srv/gump/public/workspace/objenesis/main/target/objenesis-2.7-SNAPSHOT.jar:/srv/gump/public/workspace/easymock/core/target/easymock-3.6-SNAPSHOT.jar
---------------------------------------------
    [junit] 18-Mar-2018 03:48:40.958 INFO [main] org.apache.catalina.startup.LoggingBaseTest.setUp Starting test case [testSpecExample4]
    [junit] 18-Mar-2018 03:48:40.959 INFO [main] org.apache.coyote.AbstractProtocol.destroy Destroying ProtocolHandler ["http-nio-127.0.0.1-auto-4"]
    [junit] 18-Mar-2018 03:48:40.960 INFO [main] org.apache.catalina.startup.LoggingBaseTest.setUp Starting test case [testDuplicatePaths_01]
    [junit] 18-Mar-2018 03:48:40.961 INFO [main] org.apache.coyote.AbstractProtocol.destroy Destroying ProtocolHandler ["http-nio-127.0.0.1-auto-5"]
    [junit] 18-Mar-2018 03:48:40.962 INFO [main] org.apache.catalina.startup.LoggingBaseTest.setUp Starting test case [testDuplicatePaths_02]
    [junit] 18-Mar-2018 03:48:40.962 INFO [main] org.apache.coyote.AbstractProtocol.destroy Destroying ProtocolHandler ["http-nio-127.0.0.1-auto-6"]
    [junit] 18-Mar-2018 03:48:40.963 INFO [main] org.apache.catalina.startup.LoggingBaseTest.setUp Starting test case [testDuplicatePaths_03]
    [junit] 18-Mar-2018 03:48:40.964 INFO [main] org.apache.coyote.AbstractProtocol.destroy Destroying ProtocolHandler ["http-nio-127.0.0.1-auto-7"]
    [junit] 18-Mar-2018 03:48:40.965 INFO [main] org.apache.catalina.startup.LoggingBaseTest.setUp Starting test case [testDuplicatePaths_04]
    [junit] 18-Mar-2018 03:48:40.966 INFO [main] org.apache.coyote.AbstractProtocol.destroy Destroying ProtocolHandler ["http-nio-127.0.0.1-auto-8"]
    [junit] Running util.TestCookieFilter
    [junit] Tests run: 10, Failures: 0, Errors: 0, Skipped: 0, Time elapsed: 0.027 sec

test-nio2:

test-apr-exists:

test-apr:

cobertura-report:

test:
   [concat] Testsuites with skipped tests:
   [concat] TEST-org.apache.catalina.connector.TestRequest.NIO.txt
   [concat] TEST-org.apache.catalina.core.TestDefaultInstanceManager.NIO.txt
   [concat] TEST-org.apache.catalina.loader.TestWebappClassLoaderThreadLocalMemoryLeak.NIO.txt
   [concat] TEST-org.apache.catalina.nonblocking.TestNonBlockingAPI.NIO.txt
   [concat] TEST-org.apache.coyote.http11.upgrade.TestUpgradeInternalHandler.NIO.txt
   [concat] TEST-org.apache.el.parser.TestELParser.NIO.txt
   [concat] TEST-org.apache.tomcat.jni.TestFile.NIO.txt
   [concat] TEST-org.apache.tomcat.jni.TestSocketServer.NIO.txt
   [concat] TEST-org.apache.tomcat.jni.TestSocketServerAnyLocalAddress.NIO.txt
   [concat] TEST-org.apache.tomcat.util.buf.TestByteChunk.NIO.txt
   [concat] TEST-org.apache.tomcat.util.buf.TestCharChunk.NIO.txt
   [concat] TEST-org.apache.tomcat.util.net.TestSsl.NIO.txt
   [concat] TEST-org.apache.tomcat.util.net.openssl.TestOpenSSLConf.NIO.txt
   [concat] TEST-org.apache.tomcat.util.net.openssl.ciphers.TestOpenSSLCipherConfigurationParser.NIO.txt
   [concat] TEST-org.apache.tomcat.websocket.TestConnectionLimit.NIO.txt
   [concat] TEST-org.apache.tomcat.websocket.TestWsWebSocketContainerWithProxy.NIO.txt
   [concat] TEST-org.apache.tomcat.websocket.pojo.TestEncodingDecoding.NIO.txt
   [concat] TEST-org.apache.tomcat.websocket.server.TestAsyncMessages.NIO.txt
   [concat] TEST-org.apache.tomcat.websocket.server.TestWsRemoteEndpointImplServer.NIO.txt
   [concat] Testsuites with failed tests:
   [concat] TEST-org.apache.tomcat.util.net.openssl.ciphers.TestCipher.NIO.txt
   [concat] TEST-org.apache.tomcat.util.net.openssl.ciphers.TestOpenSSLCipherConfigurationParser.NIO.txt

BUILD FAILED
/srv/gump/public/workspace/tomcat-trunk/build.xml:1384: Some tests completed with a Failure. See /srv/gump/public/workspace/tomcat-trunk/output/build/logs for details, search for "FAILED".

Total time: 24 minutes 24 seconds
---------------------------------------------

To subscribe to this information via syndicated feeds:
- RSS: http://vmgump-vm3.apache.org/tomcat-trunk/tomcat-trunk-test-nio/rss.xml
- Atom: http://vmgump-vm3.apache.org/tomcat-trunk/tomcat-trunk-test-nio/atom.xml

============================== Gump Tracking Only ===
Produced by Apache Gump(TM) version 2.3.
Gump Run 20180318000006, vmgump-vm3.apache.org:vmgump:20180318000006
Gump E-mail Identifier (unique within run) #4.

--
Apache Gump
http://gump.apache.org/ [Instance: vmgump-vm3]

---------------------------------------------------------------------
To unsubscribe, e-mail: [hidden email]
For additional commands, e-mail: [hidden email]

Reply | Threaded
Open this post in threaded view
|

Re: [GUMP@vmgump-vm3]: Project tomcat-trunk-test-nio (in module tomcat-trunk) failed

Rainer Jung-3
Am 18.03.2018 um 03:48 schrieb Bill Barker:
>     [concat] Testsuites with failed tests:
>     [concat] TEST-org.apache.tomcat.util.net.openssl.ciphers.TestCipher.NIO.txt
>     [concat] TEST-org.apache.tomcat.util.net.openssl.ciphers.TestOpenSSLCipherConfigurationParser.NIO.txt
>
> BUILD FAILED

I did a local build of OpenSSL 1.1.1-pre2 and of tcnative 1.2.16 against
that. Running the above two tests against current trunk succeeds for me
(although the test outputs quite a few errors):

test-nio:
     [junit] Running org.apache.tomcat.util.net.openssl.ciphers.TestCipher
     [junit] Tests run: 3, Failures: 0, Errors: 0, Skipped: 0, Time
elapsed: 1.33 sec
     [junit] Running
org.apache.tomcat.util.net.openssl.ciphers.TestOpenSSLCipherConfigurationParser
     [junit] Error in cipher list
     [junit] 18446744071544559396:error:1410D0B9:SSL
routines:SSL_CTX_set_cipher_list:no cipher match:ssl_lib.c:1383:
     [junit]
     [junit] Error in cipher list
     [junit] 18446744071544559396:error:1410D0B9:SSL
routines:SSL_CTX_set_cipher_list:no cipher match:ssl_lib.c:1383:
     [junit]
     [junit] Error in cipher list
     [junit] 18446744071544559396:error:1410D0B9:SSL
routines:SSL_CTX_set_cipher_list:no cipher match:ssl_lib.c:1383:
     [junit]
     [junit] Error in cipher list
     [junit] 18446744071544559396:error:1410D0B9:SSL
routines:SSL_CTX_set_cipher_list:no cipher match:ssl_lib.c:1383:
     [junit]
     [junit] Error in cipher list
     [junit] 18446744071544559396:error:1410D0B9:SSL
routines:SSL_CTX_set_cipher_list:no cipher match:ssl_lib.c:1383:
     [junit]
     [junit] Error in cipher list
     [junit] 18446744071544559396:error:1410D0B9:SSL
routines:SSL_CTX_set_cipher_list:no cipher match:ssl_lib.c:1383:
     [junit]
     [junit] Error in cipher list
     [junit] 18446744071544559396:error:1410D0B9:SSL
routines:SSL_CTX_set_cipher_list:no cipher match:ssl_lib.c:1383:
     [junit]
     [junit] Error in cipher list
     [junit] 18446744071544559396:error:1410D0B9:SSL
routines:SSL_CTX_set_cipher_list:no cipher match:ssl_lib.c:1383:
     [junit]
     [junit] Error in cipher list
     [junit] 18446744071544559396:error:1410D0B9:SSL
routines:SSL_CTX_set_cipher_list:no cipher match:ssl_lib.c:1383:
     [junit]
     [junit] Error in cipher list
     [junit] 18446744071544559396:error:1410D0B9:SSL
routines:SSL_CTX_set_cipher_list:no cipher match:ssl_lib.c:1383:
     [junit]
     [junit] Error in cipher list
     [junit] 18446744071544559396:error:1410D0B9:SSL
routines:SSL_CTX_set_cipher_list:no cipher match:ssl_lib.c:1383:
     [junit]
     [junit] Error in cipher list
     [junit] 18446744071544559396:error:1410D0B9:SSL
routines:SSL_CTX_set_cipher_list:no cipher match:ssl_lib.c:1383:
     [junit]
     [junit] Error in cipher list
     [junit] 18446744071544559396:error:1410D0B9:SSL
routines:SSL_CTX_set_cipher_list:no cipher match:ssl_lib.c:1383:
     [junit]
     [junit] Error in cipher list
     [junit] 18446744071544559396:error:1410D0B9:SSL
routines:SSL_CTX_set_cipher_list:no cipher match:ssl_lib.c:1383:
     [junit]
     [junit] Error in cipher list
     [junit] 18446744071544559396:error:1410D0B9:SSL
routines:SSL_CTX_set_cipher_list:no cipher match:ssl_lib.c:1383:
     [junit]
     [junit] Error in cipher list
     [junit] 18446744071544559396:error:1410D0B9:SSL
routines:SSL_CTX_set_cipher_list:no cipher match:ssl_lib.c:1383:
     [junit]
     [junit] Error in cipher list
     [junit] 18446744071544559396:error:1410D0B9:SSL
routines:SSL_CTX_set_cipher_list:no cipher match:ssl_lib.c:1383:
     [junit]
     [junit] Error in cipher list
     [junit] 18446744071544559396:error:1410D0B9:SSL
routines:SSL_CTX_set_cipher_list:no cipher match:ssl_lib.c:1383:
     [junit]
     [junit] Error in cipher list
     [junit] 18446744071544559396:error:1410D0B9:SSL
routines:SSL_CTX_set_cipher_list:no cipher match:ssl_lib.c:1383:
     [junit]
     [junit] Error in cipher list
     [junit] 18446744071544559396:error:1410D0B9:SSL
routines:SSL_CTX_set_cipher_list:no cipher match:ssl_lib.c:1383:
     [junit]
     [junit] Error in cipher list
     [junit] 18446744071544559396:error:1410D0B9:SSL
routines:SSL_CTX_set_cipher_list:no cipher match:ssl_lib.c:1383:
     [junit]
     [junit] Error in cipher list
     [junit] 18446744071544559396:error:1410D0B9:SSL
routines:SSL_CTX_set_cipher_list:no cipher match:ssl_lib.c:1383:
     [junit]
     [junit] Error in cipher list
     [junit] 18446744071544559396:error:1410D0B9:SSL
routines:SSL_CTX_set_cipher_list:no cipher match:ssl_lib.c:1383:
     [junit]
     [junit] Error in cipher list
     [junit] 18446744071544559396:error:1410D0B9:SSL
routines:SSL_CTX_set_cipher_list:no cipher match:ssl_lib.c:1383:
     [junit]
     [junit] Error in cipher list
     [junit] 18446744071544559396:error:1410D0B9:SSL
routines:SSL_CTX_set_cipher_list:no cipher match:ssl_lib.c:1383:
     [junit]
     [junit] Error in cipher list
     [junit] 18446744071544559396:error:1410D0B9:SSL
routines:SSL_CTX_set_cipher_list:no cipher match:ssl_lib.c:1383:
     [junit]
     [junit] Tests run: 86, Failures: 0, Errors: 0, Skipped: 1, Time
elapsed: 4.12 sec

But Gump is using OpenSSL master snapshots.

Regards,

Rainer

---------------------------------------------------------------------
To unsubscribe, e-mail: [hidden email]
For additional commands, e-mail: [hidden email]

Reply | Threaded
Open this post in threaded view
|

Re: [GUMP@vmgump-vm3]: Project tomcat-trunk-test-nio (in module tomcat-trunk) failed

Mark Thomas-2
On 18/03/18 15:30, Rainer Jung wrote:

> Am 18.03.2018 um 03:48 schrieb Bill Barker:
>>     [concat] Testsuites with failed tests:
>>     [concat]
>> TEST-org.apache.tomcat.util.net.openssl.ciphers.TestCipher.NIO.txt
>>     [concat]
>> TEST-org.apache.tomcat.util.net.openssl.ciphers.TestOpenSSLCipherConfigurationParser.NIO.txt
>>
>>
>> BUILD FAILED
>
> I did a local build of OpenSSL 1.1.1-pre2 and of tcnative 1.2.16 against
> that. Running the above two tests against current trunk succeeds for me
> (although the test outputs quite a few errors):
>
> test-nio:
>     [junit] Running org.apache.tomcat.util.net.openssl.ciphers.TestCipher
>     [junit] Tests run: 3, Failures: 0, Errors: 0, Skipped: 0, Time
> elapsed: 1.33 sec
>     [junit] Running
> org.apache.tomcat.util.net.openssl.ciphers.TestOpenSSLCipherConfigurationParser
>
>     [junit] Error in cipher list
>     [junit] 18446744071544559396:error:1410D0B9:SSL
> routines:SSL_CTX_set_cipher_list:no cipher match:ssl_lib.c:1383:

Those are normal.

<snip/>

> But Gump is using OpenSSL master snapshots.

I ran the tests locally on vmgump to validate my commits. Clearly I am
not doing something right. I'll look into this some more.

Mark

---------------------------------------------------------------------
To unsubscribe, e-mail: [hidden email]
For additional commands, e-mail: [hidden email]

Reply | Threaded
Open this post in threaded view
|

Re: [GUMP@vmgump-vm3]: Project tomcat-trunk-test-nio (in module tomcat-trunk) failed

Mark Thomas-2
On 18/03/18 20:18, Mark Thomas wrote:
> On 18/03/18 15:30, Rainer Jung wrote:
>> Am 18.03.2018 um 03:48 schrieb Bill Barker:
>>>     [concat] Testsuites with failed tests:
>>>     [concat]
>>> TEST-org.apache.tomcat.util.net.openssl.ciphers.TestCipher.NIO.txt
>>>     [concat]
>>> TEST-org.apache.tomcat.util.net.openssl.ciphers.TestOpenSSLCipherConfigurationParser.NIO.txt

<snip/>

> I ran the tests locally on vmgump to validate my commits. Clearly I am
> not doing something right. I'll look into this some more.

Well, at least it was easy to find my mistake.

When I was working on this a couple of days ago I was having issues with
the tests failing and I tried several things before I realised a Gump
run had started and the OpenSSL didn't exist.

When I came back to it I had a mix of changes both locally (on vmgump)
and on my main dev machine. I forgot to commit the local change. Hence
the tests passed when I ran them but failed when Gump ran them.

Should be fixed now.

Sorry for the noise.

Mark

---------------------------------------------------------------------
To unsubscribe, e-mail: [hidden email]
For additional commands, e-mail: [hidden email]

Reply | Threaded
Open this post in threaded view
|

Re: [GUMP@vmgump-vm3]: Project tomcat-trunk-test-nio (in module tomcat-trunk) failed

Rainer Jung-3
Am 18.03.2018 um 21:24 schrieb Mark Thomas:

> On 18/03/18 20:18, Mark Thomas wrote:
>> On 18/03/18 15:30, Rainer Jung wrote:
>>> Am 18.03.2018 um 03:48 schrieb Bill Barker:
>>>>      [concat] Testsuites with failed tests:
>>>>      [concat]
>>>> TEST-org.apache.tomcat.util.net.openssl.ciphers.TestCipher.NIO.txt
>>>>      [concat]
>>>> TEST-org.apache.tomcat.util.net.openssl.ciphers.TestOpenSSLCipherConfigurationParser.NIO.txt
>
> <snip/>
>
>> I ran the tests locally on vmgump to validate my commits. Clearly I am
>> not doing something right. I'll look into this some more.
>
> Well, at least it was easy to find my mistake.
>
> When I was working on this a couple of days ago I was having issues with
> the tests failing and I tried several things before I realised a Gump
> run had started and the OpenSSL didn't exist.
>
> When I came back to it I had a mix of changes both locally (on vmgump)
> and on my main dev machine. I forgot to commit the local change. Hence
> the tests passed when I ran them but failed when Gump ran them.
>
> Should be fixed now.

And I only updated my tcnative build to OpenSSL 1.1.1 but forgot to
update the test.openssl.path property. Now that I did it, the test fails
here but for a totally different and local reason: the "openssl ciphers
-ciphersuites" flag was only added after 1.1.1-pre2, so is currently
only available in snapshots (like Gump uses them) but not in my local
build. But that's not a problem, 1.1.1-pre3 will be coming soon.

> Sorry for the noise.

Same here.

Regards,

Rainer

---------------------------------------------------------------------
To unsubscribe, e-mail: [hidden email]
For additional commands, e-mail: [hidden email]